{"text_format":"1","workbook":"xlsx","n_sheets":4,"sheets":["Completion Instructions","Employers Details","Work Experience (A19)","Tech & Professional (A09A25)"],"not_rendered":{"charts":0,"images":6,"macros":1,"external_links":0,"defined_names":3,"comments":2,"pivot_tables":0},"unopened":[],"bounds":{"document_bytes":16777216,"sheet_cells":100000,"rows_first":2000,"rows_last":500,"rows_between":2000,"halvings":0,"cell_chars":16384,"cell_head_chars":4096},"cells_cut":0,"cells_raw":0,"read":"whole","date_system":"1900"}

{"sheet":"Completion Instructions","index":0,"n_rows":42,"n_cols":2,"rows_kept":42,"cut":false,"hidden":false,"merged":[[37,1,37,37],[38,1,38,37]]}
[]
[null,"HBF Grant Claim Form "]
[]
[null,"This claim form is intended to be emailed only"]
[]
[null,"HBFgrantclaims@citb.co.uk"]
[]
[null,"How do I claim?"]
[]
[null,"● Complete this form giving as much detail as possible about the training you are undertaking.  This form enables you to claim for training, including"]
[null,"    internal training, undertaken and qualifications achieved between 1 September 2015 and 31 December 2016.  The closing date for claims is"]
[null,"    31 March 2017. Claims received after this date will be rejected."]
[null,"● Use the correct tab along the bottom of the form for the type of grant you are claiming for."]
[null,"● Email this form to HBFgrantclaims@citb.co.uk"]
[]
[null,"Grant Information"]
[]
[null,"You can apply for grant to support attendance on training or achievement of qualifications through the following routes:"]
[]
[null,"Attendance Grants"]
[null,"● to claim sales and marketing training days use the Technical and Professional attendance (A09) grant claim  tab - a maximum of 10 days "]
[null,"   is payable per person per Grants Scheme year."]
[null,"● to claim non-construction under-graduate and post-graduate training days use the Technical and Professional attendance (A09) grant claim "]
[null,"   tab - a maximum of 35 days is payable per person per Grants Scheme year"]
[null,"● to claim non-construction work experience for under-graduates or post-graduates us the Construction-related work experience (A19) grant claim "]
[null,"   tab- a maximum of 48 weeks (240 days) is payable per person per lifetime.  You must deduct annual  leave, sickness, bank holidays and any "]
[null,"   other absence from your claim."]
[]
[null,"Achievement Grants "]
[null,"● to claim for the achievement of non-construction qualifications use the Technical and Professional achievements (A25) tab"]
{"$rows_left_out":13}
{"sheet":"Employers Details","index":1,"n_rows":61,"n_cols":48,"rows_kept":61,"cut":false,"hidden":false,"merged":[[8,6,8,30],[18,9,18,16],[52,7,52,19],[50,3,50,19],[20,5,20,29],[22,5,22,29]]}
[]
[null,"Employers Details/Declaration"]
[]
[null,"This claim form is intended to be emailed only"]
[]
[]
[null,"Employer Details (all fields are mandatory)"]
[]
[null,"Employer Name",null,null,null,null,null,null,null,null,null,null,null,null,null,null,null,null,null,null,null,null,null,null,null,null,null,null,null,null,null,null,null,null,null,null,null,null,null,null,null,null,null,null,null,null,null,{"$f":"G9","v":0}]
[]
[null,"Employer Postcode"]
[]
[null,"CITB Levy Registration Number",null,null,null,null,null,null,null,null,null,null,null,null,null,null,null,null,null,null,null,null,null,null,null,null,null,null,null,null,null,null,null,null,null,null,null,null,null,null,null,null,null,null,null,null,null,{"$f":"K13&L13&M13&N13&O13&P13&Q13","v":""}]
[]
[null,"Employer Telephone Number"]
[]
[null,"CITB Levy Establishment Number (if applicable)",null,null,null,null,null,null,null,null,null,null,null,null,null,null,null,null,null,null,null,null,null,null,null,null,null,null,null,null,null,null,null,null,null,null,null,null,null,null,null,null,null,null,null,null,null,{"$f":"O17&P17&Q17&R17&S17&T17&U17","v":""}]
[]
[null,"Your reference (if applicable)"]
[]
[null,"Contact Name"]
[]
[null,"Email Address"]
[]
[null,"Employer's Declaration (all must read and complete)"]
[]
[null,"Before completing this declaration, you should read the current CITB Grants Scheme requirements including eligibility, details of"]
[null,"terms and conditions and closing dates for grant claims. "]
[]
[null,"The scheme requirements can be found at www.citb.co.uk/grant."]
{"$rows_left_out":32}
{"sheet":"Work Experience (A19)","index":2,"n_rows":54,"n_cols":38,"rows_kept":54,"cut":false,"hidden":false,"merged":[[6,15,7,15],[6,3,7,3],[6,1,7,1],[6,13,7,13],[6,4,6,6],[6,7,7,7],[6,11,7,11],[6,12,7,12],[6,2,7,2],[6,8,7,8],[6,9,7,9],[6,10,7,10],[6,14,7,14]]}
[null,"Work experience claims"]
[]
[null,"All columns must be completed otherwise your claim will be sent back to you for completion and this could potentially delay or stop your access to grant funding"]
[]
[]
[]
[null,"Training Course title, in full\n(inc. level; e.g HNC/ONC, BSc, BEng, MEng, MSc, MA)  For example HNC in Construction Management","Name of University/College\n(write N/A if not applicable) ","University/College postcode","Training days \n(Claims must relate to the period of work experience between 1 September 2015 and 31 December 2016. Claims outside this period will be rejected.)",null,null,"Title","First Name ","Surname ","Occupation","Date of Birth (dd/mm/yy)","National Insurance Number ","Candidates VQ/SVQ number","Date joined Employer  (dd/mm/yy)","Method of Employment\n(PAYE/Net CIS Sub-contractor)"]
[null,null,null,null,"Actual date from ","Actual date to","Number of days  completed \n(max 240)",null,null,null,null,null,null,null,null,null,null,null,"Employer Name","Registration No","Establishment No","Grant Code A19","Grant Code A09","Grant Code A25","Days Claimed","Course Name","University",null,null,"For the Macro"]
[null,null,null,null,null,null,null,null,null,null,null,null,null,null,null,null,null,null,{"$f":"IF(G9>0,'Employers Details'!$AV$9,\"\")","v":""},{"$f":"IF(G9>0,'Employers Details'!$AV$13,\"\")","v":""},{"$f":"IF(G9>0,'Employers Details'!$AV$17,\"\")","v":""},{"$f":"IF(G9>0,\"A19\",\"\")","v":""},null,null,{"$f":"IF(G9>0,G9,\"\")","v":""},{"$f":"IF(G9>0,B9,\"\")","v":""},{"$f":"IF(G9>0,C9,\"\")","v":""},null,null,"Ruth's Building Contractors Ltd","1234567","2345678","A19",null,null,240,"HNC Sales & Marketing","Leeds University"]
[null,null,null,null,null,null,null,null,null,null,null,null,null,null,null,null,null,null,{"$f":"IF(G10>0,'Employers Details'!$AV$9,\"\")","v":""},{"$f":"IF(G10>0,'Employers Details'!$AV$13,\"\")","v":""},{"$f":"IF(G10>0,'Employers Details'!$AV$17,\"\")","v":""},{"$f":"IF(G10>0,\"A19\",\"\")","v":""},null,null,{"$f":"IF(G10>0,G10,\"\")","v":""},{"$f":"IF(G10>0,B10,\"\")","v":""},{"$f":"IF(G10>0,C10,\"\")","v":""},null,null,"","","","",null,null,"","",""]
[null,null,null,null,null,null,null,null,null,null,null,null,null,null,null,null,null,null,{"$f":"IF(G11>0,'Employers Details'!$AV$9,\"\")","v":""},{"$f":"IF(G11>0,'Employers Details'!$AV$13,\"\")","v":""},{"$f":"IF(G11>0,'Employers Details'!$AV$17,\"\")","v":""},"",null,null,"","","",null,null,"","","","",null,null,"","",""]
[null,null,null,null,null,null,null,null,null,null,null,null,null,null,null,null,null,null,{"$f":"IF(G12>0,'Employers Details'!$AV$9,\"\")","v":""},{"$f":"IF(G12>0,'Employers Details'!$AV$13,\"\")","v":""},{"$f":"IF(G12>0,'Employers Details'!$AV$17,\"\")","v":""},"",null,null,"","","",null,null,"","","","",null,null,"","",""]
[null,null,null,null,null,null,null,null,null,null,null,null,null,null,null,null,null,null,{"$f":"IF(G13>0,'Employers Details'!$AV$9,\"\")","v":""},{"$f":"IF(G13>0,'Employers Details'!$AV$13,\"\")","v":""},{"$f":"IF(G13>0,'Employers Details'!$AV$17,\"\")","v":""},"",null,null,"","","",null,null,"","","","",null,null,"","",""]
[null,null,null,null,null,null,null,null,null,null,null,null,null,null,null,null,null,null,{"$f":"IF(G14>0,'Employers Details'!$AV$9,\"\")","v":""},{"$f":"IF(G14>0,'Employers Details'!$AV$13,\"\")","v":""},{"$f":"IF(G14>0,'Employers Details'!$AV$17,\"\")","v":""},"",null,null,"","","",null,null,"","","","",null,null,"","",""]
[null,null,null,null,null,null,null,null,null,null,null,null,null,null,null,null,null,null,{"$f":"IF(G15>0,'Employers Details'!$AV$9,\"\")","v":""},{"$f":"IF(G15>0,'Employers Details'!$AV$13,\"\")","v":""},{"$f":"IF(G15>0,'Employers Details'!$AV$17,\"\")","v":""},"",null,null,"","","",null,null,"","","","",null,null,"","",""]
[null,null,null,null,null,null,null,null,null,null,null,null,null,null,null,null,null,null,{"$f":"IF(G16>0,'Employers Details'!$AV$9,\"\")","v":""},{"$f":"IF(G16>0,'Employers Details'!$AV$13,\"\")","v":""},{"$f":"IF(G16>0,'Employers Details'!$AV$17,\"\")","v":""},"",null,null,"","","",null,null,"","","","",null,null,"","",""]
[null,null,null,null,null,null,null,null,null,null,null,null,null,null,null,null,null,null,{"$f":"IF(G17>0,'Employers Details'!$AV$9,\"\")","v":""},{"$f":"IF(G17>0,'Employers Details'!$AV$13,\"\")","v":""},{"$f":"IF(G17>0,'Employers Details'!$AV$17,\"\")","v":""},"",null,null,"","","",null,null,"","","","",null,null,"","",""]
[null,null,null,null,null,null,null,null,null,null,null,null,null,null,null,null,null,null,{"$f":"IF(G18>0,'Employers Details'!$AV$9,\"\")","v":""},{"$f":"IF(G18>0,'Employers Details'!$AV$13,\"\")","v":""},{"$f":"IF(G18>0,'Employers Details'!$AV$17,\"\")","v":""},"",null,null,"","","",null,null,"","","","",null,null,"","",""]
[null,null,null,null,null,null,null,null,null,null,null,null,null,null,null,null,null,null,{"$f":"IF(G19>0,'Employers Details'!$AV$9,\"\")","v":""},{"$f":"IF(G19>0,'Employers Details'!$AV$13,\"\")","v":""},{"$f":"IF(G19>0,'Employers Details'!$AV$17,\"\")","v":""},"",null,null,"","","",null,null,"","","","",null,null,"","",""]
[null,null,null,null,null,null,null,null,null,null,null,null,null,null,null,null,null,null,{"$f":"IF(G20>0,'Employers Details'!$AV$9,\"\")","v":""},{"$f":"IF(G20>0,'Employers Details'!$AV$13,\"\")","v":""},{"$f":"IF(G20>0,'Employers Details'!$AV$17,\"\")","v":""},"",null,null,"","","",null,null,"","","","",null,null,"","",""]
[null,null,null,null,null,null,null,null,null,null,null,null,null,null,null,null,null,null,{"$f":"IF(G21>0,'Employers Details'!$AV$9,\"\")","v":""},{"$f":"IF(G21>0,'Employers Details'!$AV$13,\"\")","v":""},{"$f":"IF(G21>0,'Employers Details'!$AV$17,\"\")","v":""},"",null,null,"","","",null,null,"","","","",null,null,"","",""]
[null,null,null,null,null,null,null,null,null,null,null,null,null,null,null,null,null,null,{"$f":"IF(G22>0,'Employers Details'!$AV$9,\"\")","v":""},{"$f":"IF(G22>0,'Employers Details'!$AV$13,\"\")","v":""},{"$f":"IF(G22>0,'Employers Details'!$AV$17,\"\")","v":""},"",null,null,"","","",null,null,"","","","",null,null,"","",""]
[null,null,null,null,null,null,null,null,null,null,null,null,null,null,null,null,null,null,{"$f":"IF(G23>0,'Employers Details'!$AV$9,\"\")","v":""},{"$f":"IF(G23>0,'Employers Details'!$AV$13,\"\")","v":""},{"$f":"IF(G23>0,'Employers Details'!$AV$17,\"\")","v":""},"",null,null,"","","",null,null,"","","","",null,null,"","",""]
[null,null,null,null,null,null,null,null,null,null,null,null,null,null,null,null,null,null,{"$f":"IF(G24>0,'Employers Details'!$AV$9,\"\")","v":""},{"$f":"IF(G24>0,'Employers Details'!$AV$13,\"\")","v":""},{"$f":"IF(G24>0,'Employers Details'!$AV$17,\"\")","v":""},"",null,null,"","","",null,null,"","","","",null,null,"","",""]
[null,null,null,null,null,null,null,null,null,null,null,null,null,null,null,null,null,null,{"$f":"IF(G25>0,'Employers Details'!$AV$9,\"\")","v":""},{"$f":"IF(G25>0,'Employers Details'!$AV$13,\"\")","v":""},{"$f":"IF(G25>0,'Employers Details'!$AV$17,\"\")","v":""},"",null,null,"","","",null,null,"","","","",null,null,"","",""]
[null,null,null,null,null,null,null,null,null,null,null,null,null,null,null,null,null,null,{"$f":"IF(G26>0,'Employers Details'!$AV$9,\"\")","v":""},{"$f":"IF(G26>0,'Employers Details'!$AV$13,\"\")","v":""},{"$f":"IF(G26>0,'Employers Details'!$AV$17,\"\")","v":""},"",null,null,"","","",null,null,"","","","",null,null,"","",""]
[null,null,null,null,null,null,null,null,null,null,null,null,null,null,null,null,null,null,{"$f":"IF(G27>0,'Employers Details'!$AV$9,\"\")","v":""},{"$f":"IF(G27>0,'Employers Details'!$AV$13,\"\")","v":""},{"$f":"IF(G27>0,'Employers Details'!$AV$17,\"\")","v":""},"",null,null,"","","",null,null,"","","","",null,null,"","",""]
[null,null,null,null,null,null,null,null,null,null,null,null,null,null,null,null,null,null,{"$f":"IF(G28>0,'Employers Details'!$AV$9,\"\")","v":""},{"$f":"IF(G28>0,'Employers Details'!$AV$13,\"\")","v":""},{"$f":"IF(G28>0,'Employers Details'!$AV$17,\"\")","v":""},"",null,null,"","","",null,null,"","","","",null,null,"","",""]
[null,null,null,null,null,null,null,null,null,null,null,null,null,null,null,null,null,null,{"$f":"IF(G29>0,'Employers Details'!$AV$9,\"\")","v":""},{"$f":"IF(G29>0,'Employers Details'!$AV$13,\"\")","v":""},{"$f":"IF(G29>0,'Employers Details'!$AV$17,\"\")","v":""},"",null,null,"","","",null,null,"","","","",null,null,"","",""]
[null,null,null,null,null,null,null,null,null,null,null,null,null,null,null,null,null,null,{"$f":"IF(G30>0,'Employers Details'!$AV$9,\"\")","v":""},{"$f":"IF(G30>0,'Employers Details'!$AV$13,\"\")","v":""},{"$f":"IF(G30>0,'Employers Details'!$AV$17,\"\")","v":""},"",null,null,"","","",null,null,"","","","",null,null,"","",""]
{"$rows_left_out":25}
{"sheet":"Tech & Professional (A09A25)","index":3,"n_rows":54,"n_cols":49,"rows_kept":54,"cut":false,"hidden":false,"merged":[[49,16,49,18],[43,16,43,18],[37,16,37,18],[38,16,38,18],[39,16,39,18],[40,16,40,18],[41,16,41,18],[42,16,42,18],[49,19,49,20],[34,19,34,20],[34,16,34,18],[33,19,33,20],[50,16,50,18],[50,19,50,20],[43,19,43,20],[37,19,37,20],[38,19,38,20],[41,19,41,20],[42,19,42,20],[45,19,45,20],[46,19,46,20],[46,16,46,18],[45,16,45,18],[47,16,47,18],[33,16,33,18],[32,19,32,20],[32,16,32,18],[31,19,31,20],[31,16,31,18],[30,19,30,20],[30,16,30,18],[29,19,29,20],[29,16,29,18],[28,19,28,20],[28,16,28,18],[27,19,27,20],[27,16,27,18],[26,19,26,20],[26,16,26,18],[25,19,25,20],[25,16,25,18],[24,19,24,20],[24,16,24,18],[23,19,23,20],[23,16,23,18],[22,19,22,20],[22,16,22,18],[21,19,21,20],[21,16,21,18],[20,19,20,20],[20,16,20,18],[19,19,19,20],[19,16,19,18],[18,16,18,18],[17,19,17,20],[17,16,17,18],[16,19,16,20],[16,16,16,18],[7,19,7,20],[7,16,7,18],[10,19,10,20],[10,16,10,18],[9,19,9,20],[9,16,9,18],[48,16,48,18],[35,19,35,20],[36,19,36,20],[44,19,44,20],[48,19,48,20],[39,19,39,20],[40,19,40,20],[47,19,47,20],[8,19,8,20],[8,16,8,18],[35,16,35,18],[36,16,36,18],[44,16,44,18],[12,19,12,20],[12,16,12,18],[11,19,11,20],[11,16,11,18],[15,19,15,20],[15,16,15,18],[14,19,14,20],[14,16,14,18],[13,19,13,20],[13,16,13,18],[18,19,18,20]]}
[null,"Technical and Professional attendance (A09) and achievement (A25) claims"]
[]
[null,"All columns must be completed otherwise your claim will be sent back to you for completion and this could potentially delay or stop your access to grant funding"]
[]
[]
[null,null,null,null,null,null,null,null,null,null,null,null,null,null,null,null,null,null,null,null,null,null,null,null,null,null,null,null,null,null,null,null,null,null,null,null,null,null,"Employer Name","Registration No","Establishment No","Grant Code A19","Grant Code A09","Grant Code A25","Days Claimed","Course Name","University","Level","Occupation Category"]
[]
[null,"Title of Training Course/Achievement                ","Level of training        e.g. BTEC, Degree, HNC","Training Providers Name ","Training Providers Postcode","Course Start Date \n(dd/mm/yy)","Course End Date \n(dd/mm/yy)","Achievement Date\n(dd/mm/yy)","Course Duration\n(number of days)","Title ","First Name ","Surname ","Occupation","Occupation Category","Date of Birth\n(dd/mm/yy)","National Insurance Number ","Candidates VQ/SVQ Number",null,null,"Date Joined Employer\n(dd/mm/yy)",null,"Method of Employment (PAYE/Net CIS Sub-contractor)",null,null,null,"Employer Name","Registration No","Establishment No","Grant Code A19","Grant Code A09","Grant Code A25","Days Claimed","Course Name","University","Level","Occupation Category",null,null,"For the Macro"]
[null,null,null,null,null,null,null,null,null,null,null,null,null,null,null,null,null,null,null,null,null,null,null,null,null,{"$f":"IF(I9&H9=\"\",\"\",'Employers Details'!$AV$9)","v":""},{"$f":"IF(I9&H9=\"\",\"\",'Employers Details'!$AV$13)","v":""},{"$f":"IF(I9&H9=\"\",\"\",'Employers Details'!$AV$17)","v":""},null,{"$f":"IF(I9>0,\"A09\",\"\")","v":""},{"$f":"IF(H9=\"\",\"\",\"A25\")","v":""},{"$f":"IF(AD9=\"A09\",I9,\"\")","v":""},{"$f":"IF(B9=\"\",\"\",B9)","v":""},{"$f":"IF(D9=\"\",\"\",D9)","v":""},{"$f":"IF(C9=\"\",\"\",C9)","v":""},{"$f":"IF(N9=\"\",\"\",N9)","v":""},null,null,"Ruth's Building Contractors Ltd","1234567","2345678",null,"A09","A25",10,"HNC Sales","Leeds University","Degree","Sales & Marketing"]
[null,null,null,null,null,null,null,null,null,null,null,null,null,null,null,null,null,null,null,null,null,null,null,null,null,{"$f":"IF(I10&H10=\"\",\"\",'Employers Details'!$AV$9)","v":""},{"$f":"IF(I10&H10=\"\",\"\",'Employers Details'!$AV$13)","v":""},{"$f":"IF(I10&H10=\"\",\"\",'Employers Details'!$AV$17)","v":""},null,{"$f":"IF(I10>0,\"A09\",\"\")","v":""},{"$f":"IF(H10=\"\",\"\",\"A25\")","v":""},{"$f":"IF(AD10=\"A09\",I10,\"\")","v":""},{"$f":"IF(B10=\"\",\"\",B10)","v":""},{"$f":"IF(D10=\"\",\"\",D10)","v":""},{"$f":"IF(C10=\"\",\"\",C10)","v":""},{"$f":"IF(N10=\"\",\"\",N10)","v":""},null,null,"Ruth's Building Contractors Ltd","1234567","2345678",null,"A09","A25",10,"HNC Accountancy","Leeds University","Degree","Non-Construction"]
[null,null,null,null,null,null,null,null,null,null,null,null,null,null,null,null,null,null,null,null,null,null,null,null,null,{"$f":"IF(I11&H11=\"\",\"\",'Employers Details'!$AV$9)","v":""},{"$f":"IF(I11&H11=\"\",\"\",'Employers Details'!$AV$13)","v":""},{"$f":"IF(I11&H11=\"\",\"\",'Employers Details'!$AV$17)","v":""},null,"","","","","","","",null,null,"","","",null,"","","","","","",""]
[null,null,null,null,null,null,null,null,null,null,null,null,null,null,null,null,null,null,null,null,null,null,null,null,null,{"$f":"IF(I12&H12=\"\",\"\",'Employers Details'!$AV$9)","v":""},{"$f":"IF(I12&H12=\"\",\"\",'Employers Details'!$AV$13)","v":""},{"$f":"IF(I12&H12=\"\",\"\",'Employers Details'!$AV$17)","v":""},null,"","","","","","","",null,null,"","","",null,"","","","","","",""]
[null,null,null,null,null,null,null,null,null,null,null,null,null,null,null,null,null,null,null,null,null,null,null,null,null,{"$f":"IF(I13&H13=\"\",\"\",'Employers Details'!$AV$9)","v":""},{"$f":"IF(I13&H13=\"\",\"\",'Employers Details'!$AV$13)","v":""},{"$f":"IF(I13&H13=\"\",\"\",'Employers Details'!$AV$17)","v":""},null,"","","","","","","",null,null,"","","",null,"","","","","","",""]
[null,null,null,null,null,null,null,null,null,null,null,null,null,null,null,null,null,null,null,null,null,null,null,null,null,{"$f":"IF(I14&H14=\"\",\"\",'Employers Details'!$AV$9)","v":""},{"$f":"IF(I14&H14=\"\",\"\",'Employers Details'!$AV$13)","v":""},{"$f":"IF(I14&H14=\"\",\"\",'Employers Details'!$AV$17)","v":""},null,"","","","","","","",null,null,"","","",null,"","","","","","",""]
[null,null,null,null,null,null,null,null,null,null,null,null,null,null,null,null,null,null,null,null,null,null,null,null,null,{"$f":"IF(I15&H15=\"\",\"\",'Employers Details'!$AV$9)","v":""},{"$f":"IF(I15&H15=\"\",\"\",'Employers Details'!$AV$13)","v":""},{"$f":"IF(I15&H15=\"\",\"\",'Employers Details'!$AV$17)","v":""},null,"","","","","","","",null,null,"","","",null,"","","","","","",""]
[null,null,null,null,null,null,null,null,null,null,null,null,null,null,null,null,null,null,null,null,null,null,null,null,null,{"$f":"IF(I16&H16=\"\",\"\",'Employers Details'!$AV$9)","v":""},{"$f":"IF(I16&H16=\"\",\"\",'Employers Details'!$AV$13)","v":""},{"$f":"IF(I16&H16=\"\",\"\",'Employers Details'!$AV$17)","v":""},null,"","","","","","","",null,null,"","","",null,"","","","","","",""]
[null,null,null,null,null,null,null,null,null,null,null,null,null,null,null,null,null,null,null,null,null,null,null,null,null,{"$f":"IF(I17&H17=\"\",\"\",'Employers Details'!$AV$9)","v":""},{"$f":"IF(I17&H17=\"\",\"\",'Employers Details'!$AV$13)","v":""},{"$f":"IF(I17&H17=\"\",\"\",'Employers Details'!$AV$17)","v":""},null,"","","","","","","",null,null,"","","",null,"","","","","","",""]
[null,null,null,null,null,null,null,null,null,null,null,null,null,null,null,null,null,null,null,null,null,null,null,null,null,{"$f":"IF(I18&H18=\"\",\"\",'Employers Details'!$AV$9)","v":""},{"$f":"IF(I18&H18=\"\",\"\",'Employers Details'!$AV$13)","v":""},{"$f":"IF(I18&H18=\"\",\"\",'Employers Details'!$AV$17)","v":""},null,"","","","","","","",null,null,"","","",null,"","","","","","",""]
[null,null,null,null,null,null,null,null,null,null,null,null,null,null,null,null,null,null,null,null,null,null,null,null,null,{"$f":"IF(I19&H19=\"\",\"\",'Employers Details'!$AV$9)","v":""},{"$f":"IF(I19&H19=\"\",\"\",'Employers Details'!$AV$13)","v":""},{"$f":"IF(I19&H19=\"\",\"\",'Employers Details'!$AV$17)","v":""},null,"","","","","","","",null,null,"","","",null,"","","","","","",""]
[null,null,null,null,null,null,null,null,null,null,null,null,null,null,null,null,null,null,null,null,null,null,null,null,null,{"$f":"IF(I20&H20=\"\",\"\",'Employers Details'!$AV$9)","v":""},{"$f":"IF(I20&H20=\"\",\"\",'Employers Details'!$AV$13)","v":""},{"$f":"IF(I20&H20=\"\",\"\",'Employers Details'!$AV$17)","v":""},null,"","","","","","","",null,null,"","","",null,"","","","","","",""]
[null,null,null,null,null,null,null,null,null,null,null,null,null,null,null,null,null,null,null,null,null,null,null,null,null,{"$f":"IF(I21&H21=\"\",\"\",'Employers Details'!$AV$9)","v":""},{"$f":"IF(I21&H21=\"\",\"\",'Employers Details'!$AV$13)","v":""},{"$f":"IF(I21&H21=\"\",\"\",'Employers Details'!$AV$17)","v":""},null,"","","","","","","",null,null,"","","",null,"","","","","","",""]
[null,null,null,null,null,null,null,null,null,null,null,null,null,null,null,null,null,null,null,null,null,null,null,null,null,{"$f":"IF(I22&H22=\"\",\"\",'Employers Details'!$AV$9)","v":""},{"$f":"IF(I22&H22=\"\",\"\",'Employers Details'!$AV$13)","v":""},{"$f":"IF(I22&H22=\"\",\"\",'Employers Details'!$AV$17)","v":""},null,"","","","","","","",null,null,"","","",null,"","","","","","",""]
[null,null,null,null,null,null,null,null,null,null,null,null,null,null,null,null,null,null,null,null,null,null,null,null,null,{"$f":"IF(I23&H23=\"\",\"\",'Employers Details'!$AV$9)","v":""},{"$f":"IF(I23&H23=\"\",\"\",'Employers Details'!$AV$13)","v":""},{"$f":"IF(I23&H23=\"\",\"\",'Employers Details'!$AV$17)","v":""},null,"","","","","","","",null,null,"","","",null,"","","","","","",""]
[null,null,null,null,null,null,null,null,null,null,null,null,null,null,null,null,null,null,null,null,null,null,null,null,null,{"$f":"IF(I24&H24=\"\",\"\",'Employers Details'!$AV$9)","v":""},{"$f":"IF(I24&H24=\"\",\"\",'Employers Details'!$AV$13)","v":""},{"$f":"IF(I24&H24=\"\",\"\",'Employers Details'!$AV$17)","v":""},null,"","","","","","","",null,null,"","","",null,"","","","","","",""]
[null,null,null,null,null,null,null,null,null,null,null,null,null,null,null,null,null,null,null,null,null,null,null,null,null,{"$f":"IF(I25&H25=\"\",\"\",'Employers Details'!$AV$9)","v":""},{"$f":"IF(I25&H25=\"\",\"\",'Employers Details'!$AV$13)","v":""},{"$f":"IF(I25&H25=\"\",\"\",'Employers Details'!$AV$17)","v":""},null,"","","","","","","",null,null,"","","",null,"","","","","","",""]
[null,null,null,null,null,null,null,null,null,null,null,null,null,null,null,null,null,null,null,null,null,null,null,null,null,{"$f":"IF(I26&H26=\"\",\"\",'Employers Details'!$AV$9)","v":""},{"$f":"IF(I26&H26=\"\",\"\",'Employers Details'!$AV$13)","v":""},{"$f":"IF(I26&H26=\"\",\"\",'Employers Details'!$AV$17)","v":""},null,"","","","","","","",null,null,"","","",null,"","","","","","",""]
[null,null,null,null,null,null,null,null,null,null,null,null,null,null,null,null,null,null,null,null,null,null,null,null,null,{"$f":"IF(I27&H27=\"\",\"\",'Employers Details'!$AV$9)","v":""},{"$f":"IF(I27&H27=\"\",\"\",'Employers Details'!$AV$13)","v":""},{"$f":"IF(I27&H27=\"\",\"\",'Employers Details'!$AV$17)","v":""},null,"","","","","","","",null,null,"","","",null,"","","","","","",""]
[null,null,null,null,null,null,null,null,null,null,null,null,null,null,null,null,null,null,null,null,null,null,null,null,null,{"$f":"IF(I28&H28=\"\",\"\",'Employers Details'!$AV$9)","v":""},{"$f":"IF(I28&H28=\"\",\"\",'Employers Details'!$AV$13)","v":""},{"$f":"IF(I28&H28=\"\",\"\",'Employers Details'!$AV$17)","v":""},null,"","","","","","","",null,null,"","","",null,"","","","","","",""]
[null,null,null,null,null,null,null,null,null,null,null,null,null,null,null,null,null,null,null,null,null,null,null,null,null,{"$f":"IF(I29&H29=\"\",\"\",'Employers Details'!$AV$9)","v":""},{"$f":"IF(I29&H29=\"\",\"\",'Employers Details'!$AV$13)","v":""},{"$f":"IF(I29&H29=\"\",\"\",'Employers Details'!$AV$17)","v":""},null,"","","","","","","",null,null,"","","",null,"","","","","","",""]
[null,null,null,null,null,null,null,null,null,null,null,null,null,null,null,null,null,null,null,null,null,null,null,null,null,{"$f":"IF(I30&H30=\"\",\"\",'Employers Details'!$AV$9)","v":""},{"$f":"IF(I30&H30=\"\",\"\",'Employers Details'!$AV$13)","v":""},{"$f":"IF(I30&H30=\"\",\"\",'Employers Details'!$AV$17)","v":""},null,"","","","","","","",null,null,"","","",null,"","","","","","",""]
{"$rows_left_out":24}